Target
Muscarinic acetylcholine receptor M2
Ligand
BDBM50095113
Substrate
Meas. Tech.
ChEBML_140175
Ki
2.9±n/a nM
Citation
 Boyle, CDChackalamannil, SChen, LYDugar, SPushpavanam, PBillard, WBinch, HCrosby, GCohen-Williams, MCoffin, VLDuffy, RARuperto, VLachowicz, JE Benzylidene ketal derivatives as M2 muscarinic receptor antagonists. Bioorg Med Chem Lett 10:2727-30 (2000)  
Target
Name:
Muscarinic acetylcholine receptor M2
Synonyms:
ACM2_HUMAN Cholinergic, muscarinic M2 Muscarinic acetylcholine receptor M2 and M5 | RecName: Full=Muscarinic acetylcholine receptor M2
Type:
GPCR
Mol. Mass.:
51730.61
Organism:
Homo sapiens (Human)
Description:
P08172
Residue:
466
  
Inhibitor
Name:
BDBM50095113
Synonyms:
4-[4-(4-Methoxy-benzenesulfonyl)-benzoyl]-[1,4']bipiperidinyl-1'-carboxylic acid ethyl ester | CHEMBL92110
Type:
Small organic molecule
Emp. Form.:
C27H34N2O6S
Mol. Mass.:
514.634
SMILES:
CCOC(=O)N1CCC(CC1)N1CCC(CC1)C(=O)c1ccc(cc1)S(=O)(=O)c1ccc(OC)cc1
: