Target
Hydroxycarboxylic acid receptor 1
Ligand
BDBM50047422
Substrate
Meas. Tech.
ChEMBL_1978551 (CHEMBL4611686)
EC50
7000±n/a nM
Citation
 Davidsson, ÖNilsson, KBrånalt, JAndersson, TBerggren, KChen, YFjellström, OGradén, HGustafsson, LHermansson, NOJansen, FJohannesson, POhlsson, BTyrchan, CWellner, AWellner, EÖlwegård-Halvarsson, M Identification of novel GPR81 agonist lead series for target biology evaluation. Bioorg Med Chem Lett 30:0 (2020)  
Target
Name:
Hydroxycarboxylic acid receptor 1
Synonyms:
G-protein coupled receptor 104 GPR81 HCAR1 | HCAR1_HUMAN
Type:
PROTEIN
Mol. Mass.:
39313.04
Organism:
Homo sapiens (Human)
Description:
ChEMBL_850283
Residue:
346
  
Inhibitor
Name:
BDBM50047422
Synonyms:
CHEMBL3319403
Type:
Small organic molecule
Emp. Form.:
C24H23ClN6O4S2
Mol. Mass.:
559.06
SMILES:
CN1CCC(CC1)S(=O)(=O)c1ccc2nc(NC(=O)NC(=O)c3cc(ccc3Cl)-n3cccn3)sc2c1
: