Target
Hydroxycarboxylic acid receptor 1
Ligand
BDBM50539674
Substrate
Meas. Tech.
ChEMBL_1978551 (CHEMBL4611686)
EC50
560±n/a nM
Citation
 Davidsson, ÖNilsson, KBrånalt, JAndersson, TBerggren, KChen, YFjellström, OGradén, HGustafsson, LHermansson, NOJansen, FJohannesson, POhlsson, BTyrchan, CWellner, AWellner, EÖlwegård-Halvarsson, M Identification of novel GPR81 agonist lead series for target biology evaluation. Bioorg Med Chem Lett 30:0 (2020)  
Target
Name:
Hydroxycarboxylic acid receptor 1
Synonyms:
G-protein coupled receptor 104 GPR81 HCAR1 | HCAR1_HUMAN
Type:
PROTEIN
Mol. Mass.:
39313.04
Organism:
Homo sapiens (Human)
Description:
ChEMBL_850283
Residue:
346
  
Inhibitor
Name:
BDBM50539674
Synonyms:
CHEMBL4636849
Type:
Small organic molecule
Emp. Form.:
C23H26ClN5O3S
Mol. Mass.:
488.002
SMILES:
CCOc1ccc(C(=O)NC(=O)Nc2nc3ccc(CN4CCN(C)CC4)cc3s2)c(Cl)c1
: