Target
Hydroxycarboxylic acid receptor 1
Ligand
BDBM50539686
Substrate
Meas. Tech.
ChEMBL_1978551 (CHEMBL4611686)
EC50
490±n/a nM
Citation
 Davidsson, ÖNilsson, KBrånalt, JAndersson, TBerggren, KChen, YFjellström, OGradén, HGustafsson, LHermansson, NOJansen, FJohannesson, POhlsson, BTyrchan, CWellner, AWellner, EÖlwegård-Halvarsson, M Identification of novel GPR81 agonist lead series for target biology evaluation. Bioorg Med Chem Lett 30:0 (2020)  
Target
Name:
Hydroxycarboxylic acid receptor 1
Synonyms:
G-protein coupled receptor 104 GPR81 HCAR1 | HCAR1_HUMAN
Type:
PROTEIN
Mol. Mass.:
39313.04
Organism:
Homo sapiens (Human)
Description:
ChEMBL_850283
Residue:
346
  
Inhibitor
Name:
BDBM50539686
Synonyms:
CHEMBL4644587
Type:
Small organic molecule
Emp. Form.:
C23H21ClN4O3S
Mol. Mass.:
468.956
SMILES:
CCOc1cc(Cl)c(cc1N1CCOCC1)-c1ncc(-c2nc3ccccc3s2)c(=O)[nH]1
: