Target
Muscarinic acetylcholine receptor M3
Ligand
BDBM50095665
Substrate
Meas. Tech.
ChEMBL_138696 (CHEMBL747663)
Ki
30±n/a nM
Citation
 Mitsuya, MKobayashi, KKawakami, KSatoh, AOgino, YKakikawa, TOhtake, NKimura, THirose, HSato, ANumazawa, THasegawa, TNoguchi, KMase, T A potent, long-acting, orally active (2R)-2-[(1R)-3, 3-difluorocyclopentyl]-2-hydroxy-2-phenylacetamide: novel muscarinic M(3) receptor antagonist with high selectivity for M(3) over M(2) receptors. J Med Chem 43:5017-29 (2001)  
Target
Name:
Muscarinic acetylcholine receptor M3
Synonyms:
ACM3_HUMAN Cholinergic, muscarinic M3 Muscarinic receptor M3 | RecName: Full=Muscarinic acetylcholine receptor M3
Type:
Enzyme
Mol. Mass.:
66151.03
Organism:
Homo sapiens (Human)
Description:
P20309
Residue:
590
  
Inhibitor
Name:
BDBM50095665
Synonyms:
2-(3,3-Difluoro-cyclopentyl)-N-(1-furan-3-ylmethyl-piperidin-4-yl)-2-hydroxy-2-phenyl-acetamide | CHEMBL147695
Type:
Small organic molecule
Emp. Form.:
C23H28F2N2O3
Mol. Mass.:
418.4768
SMILES:
O[C@@]([C@@H]1CCC(F)(F)C1)(C(=O)NC1CCN(Cc2ccoc2)CC1)c1ccccc1
: