Target
Muscarinic acetylcholine receptor M2
Ligand
BDBM50095672
Substrate
Meas. Tech.
ChEMBL_139640 (CHEMBL748253)
Ki
3100±n/a nM
Citation
 Mitsuya, MKobayashi, KKawakami, KSatoh, AOgino, YKakikawa, TOhtake, NKimura, THirose, HSato, ANumazawa, THasegawa, TNoguchi, KMase, T A potent, long-acting, orally active (2R)-2-[(1R)-3, 3-difluorocyclopentyl]-2-hydroxy-2-phenylacetamide: novel muscarinic M(3) receptor antagonist with high selectivity for M(3) over M(2) receptors. J Med Chem 43:5017-29 (2001)  
Target
Name:
Muscarinic acetylcholine receptor M2
Synonyms:
ACM2_HUMAN Cholinergic, muscarinic M2 Muscarinic acetylcholine receptor M2 and M5 | RecName: Full=Muscarinic acetylcholine receptor M2
Type:
GPCR
Mol. Mass.:
51730.61
Organism:
Homo sapiens (Human)
Description:
P08172
Residue:
466
  
Inhibitor
Name:
BDBM50095672
Synonyms:
CHEMBL148129 | N-(1-Cycloheptylmethyl-piperidin-4-yl)-2-cyclopentyl-2-hydroxy-2-phenyl-acetamide
Type:
Small organic molecule
Emp. Form.:
C26H40N2O2
Mol. Mass.:
412.608
SMILES:
OC(C1CCCC1)(C(=O)NC1CCN(CC2CCCCCC2)CC1)c1ccccc1
: