Target
Serine/threonine-protein kinase DCLK1
Ligand
BDBM50337145
Substrate
Meas. Tech.
ChEMBL_1979827 (CHEMBL4612962)
IC50
>2000±n/a nM
Citation
 Ferguson, FMLiu, YHarshbarger, WHuang, LWang, JDeng, XCapuzzi, SJMuratov, ENTropsha, AMuthuswamy, SWestover, KDGray, NS Synthesis and Structure-Activity Relationships of DCLK1 Kinase Inhibitors Based on a 5,11-Dihydro-6 J Med Chem 63:7817-7826 (2020)  
Target
Name:
Serine/threonine-protein kinase DCLK1
Synonyms:
DCAMKL1 DCLK1 KIAA0369 | Serine/threonine-protein kinase DCLK1
Type:
PROTEIN
Mol. Mass.:
82239.64
Organism:
Homo sapiens (Human)
Description:
ChEMBL_774446
Residue:
740
  
Inhibitor
Name:
BDBM50337145
Synonyms:
9-chloro-2-((2-methoxy-4-(4-methylpiperazin-1-yl)phenyl)amino)-5,11-dimethyl-5H-benzo[e]pyrimido[5,4-b][1,4]diazepin-6(11H)-one | CHEMBL1673057
Type:
Small organic molecule
Emp. Form.:
C25H28ClN7O2
Mol. Mass.:
493.989
SMILES:
COc1cc(ccc1Nc1ncc2N(C)C(=O)c3ccc(Cl)cc3N(C)c2n1)N1CCN(C)CC1
: