Target
Bromodomain-containing protein 9
Ligand
BDBM50540510
Substrate
Meas. Tech.
ChEMBL_1982129 (CHEMBL4615391)
Ki
158±n/a nM
Citation
 Clegg, MABamborough, PChung, CWCraggs, PDGordon, LGrandi, PLeveridge, MLindon, MLiwicki, GMMichon, AMMolnar, JRioja, ISoden, PETheodoulou, NHWerner, TTomkinson, NCOPrinjha, RKHumphreys, PG Application of Atypical Acetyl-lysine Methyl Mimetics in the Development of Selective Inhibitors of the Bromodomain-Containing Protein 7 (BRD7)/Bromodomain-Containing Protein 9 (BRD9) Bromodomains. J Med Chem 63:5816-5840 (2020)  
Target
Name:
Bromodomain-containing protein 9
Synonyms:
BRD9 Bromodomain-containing protein 9 | Rhabdomyosarcoma antigen MU-RMS-40.8
Type:
PROTEIN
Mol. Mass.:
66994.30
Organism:
Homo sapiens (Human)
Description:
ChEMBL_108000
Residue:
597
  
Inhibitor
Name:
BDBM50540510
Synonyms:
CHEMBL4645137
Type:
Small organic molecule
Emp. Form.:
C16H20N4O
Mol. Mass.:
284.3562
SMILES:
CN1CCc2c(C1)cccc2Nc1cnn(C)c(=O)c1C
: