Target
Mu-type opioid receptor
Ligand
BDBM50096716
Substrate
Meas. Tech.
ChEBML_148999
Ki
0.006800±n/a nM
Citation
 Sasaki, YHirabuki, MAmbo, AOuchi, HYamamoto, Y Enkephalin analogues with 2',6'-dimethylphenylalanine replacing phenylalanine in position 4. Bioorg Med Chem Lett 11:327-9 (2001)  
Target
Name:
Mu-type opioid receptor
Synonyms:
MOR-1 Mu-type opioid receptor (MOR) OPRM_RAT Opioid receptor B Ror-b
Type:
G Protein-Coupled Receptor (GPCR)
Mol. Mass.:
44503.11
Organism:
Rattus norvegicus (rat)
Description:
Competition binding assays were carried out using membrane preparations from transfected HN9.10 cells that constitutively expressed the mu opioid receptor.
Residue:
398
  
Inhibitor
Name:
BDBM50096716
Synonyms:
CHEMBL100480 | Enkephalin derivative
Type:
Small organic molecule
Emp. Form.:
C30H41N5O7
Mol. Mass.:
583.6758
SMILES:
CC(C)C[C@H](NC(=O)[C@H](Cc1ccccc1)NC(=O)CNC(=O)CNC(=O)[C@@H](N)Cc1c(C)cc(O)cc1C)C(O)=O
: