Target
Carbonic anhydrase 1
Ligand
BDBM50133406
Substrate
Meas. Tech.
ChEMBL_1982259 (CHEMBL4615521)
Ki
8.9±n/a nM
Citation
 La Regina, GPuxeddu, MNalli, MVullo, DGratteri, PSupuran, CTNocentini, ASilvestri, R Discovery of New 1,1'-Biphenyl-4-sulfonamides as Selective Subnanomolar Human Carbonic Anhydrase II Inhibitors. ACS Med Chem Lett 11:633-637 (2020)  
Target
Name:
Carbonic anhydrase 1
Synonyms:
CA-I CAB Carbonate dehydratase I Carbonic anhydrase 1 (CA I) Carbonic anhydrase 1 (Recombinant CA I) Carbonic anhydrase B Carbonic anhydrase I (CA I) Carbonic anhydrase I (CAI) Carbonic anhydrase isoenzyme I (hCA I) | hCA
Type:
Enzyme
Mol. Mass.:
28873.37
Organism:
Homo sapiens (Human)
Description:
P00915
Residue:
261
  
Inhibitor
Name:
BDBM50133406
Synonyms:
CHEMBL3632842
Type:
Small organic molecule
Emp. Form.:
C19H16N2O5S
Mol. Mass.:
384.406
SMILES:
NS(=O)(=O)c1ccc(cc1)-c1ccc(cc1)C(O)c1ccc(cc1)[N+]([O-])=O
: