Target
Carbonic anhydrase 2
Ligand
BDBM50133406
Substrate
Meas. Tech.
ChEMBL_1982260 (CHEMBL4615522)
Ki
5.9±n/a nM
Citation
 La Regina, GPuxeddu, MNalli, MVullo, DGratteri, PSupuran, CTNocentini, ASilvestri, R Discovery of New 1,1'-Biphenyl-4-sulfonamides as Selective Subnanomolar Human Carbonic Anhydrase II Inhibitors. ACS Med Chem Lett 11:633-637 (2020)  
Target
Name:
Carbonic anhydrase 2
Synonyms:
CA-II CAC Carbonate dehydratase II Carbonic anhydrase 2 (CA-II) Carbonic anhydrase C Carbonic anhydrase II (CA-II) Carbonic anhydrase II (hCA II) | Carbonic anhydrase isoenzyme II (hCA II)
Type:
Enzyme
Mol. Mass.:
29250.71
Organism:
Homo sapiens (Human)
Description:
P00918
Residue:
260
  
Inhibitor
Name:
BDBM50133406
Synonyms:
CHEMBL3632842
Type:
Small organic molecule
Emp. Form.:
C19H16N2O5S
Mol. Mass.:
384.406
SMILES:
NS(=O)(=O)c1ccc(cc1)-c1ccc(cc1)C(O)c1ccc(cc1)[N+]([O-])=O
: