Target
Carbonic anhydrase 9
Ligand
BDBM50133406
Substrate
Meas. Tech.
ChEMBL_1982261 (CHEMBL4615523)
Ki
678±n/a nM
Citation
 La Regina, GPuxeddu, MNalli, MVullo, DGratteri, PSupuran, CTNocentini, ASilvestri, R Discovery of New 1,1'-Biphenyl-4-sulfonamides as Selective Subnanomolar Human Carbonic Anhydrase II Inhibitors. ACS Med Chem Lett 11:633-637 (2020)  
Target
Name:
Carbonic anhydrase 9
Synonyms:
CA-IX CAH9_HUMAN Carbonic anhydrase 9 (CA IX) Carbonic anhydrase 9 precursor Carbonic anhydrase IX (CAIX) Carbonic anhydrases; II & IX MN RCC-associated antigen G250
Type:
Enzyme
Mol. Mass.:
49669.03
Organism:
Homo sapiens (Human)
Description:
Catalytic domain of human cloned isozyme was used in the assay
Residue:
459
  
Inhibitor
Name:
BDBM50133406
Synonyms:
CHEMBL3632842
Type:
Small organic molecule
Emp. Form.:
C19H16N2O5S
Mol. Mass.:
384.406
SMILES:
NS(=O)(=O)c1ccc(cc1)-c1ccc(cc1)C(O)c1ccc(cc1)[N+]([O-])=O
: