Target
Beta-3 adrenergic receptor
Ligand
BDBM50096782
Substrate
Meas. Tech.
ChEBML_38797
EC50
42±n/a nM
Citation
 Brockunier, LLCandelore, MRCascieri, MALiu, YTota, LWyvratt, MJFisher, MHWeber, AEParmee, ER Human beta3 adrenergic receptor agonists containing cyanoguanidine and nitroethylenediamine moieties. Bioorg Med Chem Lett 11:379-82 (2001)  
Target
Name:
Beta-3 adrenergic receptor
Synonyms:
ADRB3 ADRB3_HUMAN Beta-2 adrenergic receptor and beta-3 adrenergic receptor Beta-3 adrenoreceptor | adrenergic Beta3
Type:
G Protein-Coupled Receptor (GPCR)
Mol. Mass.:
43534.88
Organism:
Homo sapiens (Human)
Description:
Residue:
408
  
Inhibitor
Name:
BDBM50096782
Synonyms:
CHEMBL439794 | Cyanoguanidine derivative
Type:
Small organic molecule
Emp. Form.:
C27H26N6O
Mol. Mass.:
450.5349
SMILES:
O[C@@H](CNCCc1ccc(NC(Nc2cccc3ccccc23)=NC#N)cc1)c1cccnc1
: