Target
Cannabinoid receptor 1
Ligand
BDBM50096885
Substrate
Meas. Tech.
ChEBML_40026
Ki
2430±n/a nM
Citation
 Bezuglov, VBobrov, MGretskaya, NGonchar, AZinchenko, GMelck, DBisogno, TDi Marzo, VKuklev, DRossi, JCVidal, JPDurand, T Synthesis and biological evaluation of novel amides of polyunsaturated fatty acids with dopamine. Bioorg Med Chem Lett 11:447-9 (2001)  
Target
Name:
Cannabinoid receptor 1
Synonyms:
Brain-type cannabinoid receptor CB-R CNR1_RAT Cannabinoid receptor Cnr1 | Skr6
Type:
G Protein-Coupled Receptor (GPCR)
Mol. Mass.:
52856.55
Organism:
Rattus norvegicus (rat)
Description:
P20272
Residue:
473
  
Inhibitor
Name:
BDBM50096885
Synonyms:
(6Z,9Z,12Z,15Z)-Octadeca-6,9,12,15-tetraenoic acid [2-(3,4-dihydroxy-phenyl)-ethyl]-amide | CHEMBL343285
Type:
Small organic molecule
Emp. Form.:
C26H37NO3
Mol. Mass.:
411.5769
SMILES:
CC\C=C/C\C=C/C\C=C/C\C=C/CCCCC(=O)NCCc1ccc(O)c(O)c1
: