Target
Bifunctional glutamate/proline--tRNA ligase
Ligand
BDBM50097084
Substrate
Meas. Tech.
ChEBML_223472
IC50
>100000±n/a nM
Citation
 Yu, XYHill, JMYu, GYang, YKluge, AFKeith, DFinn, JGallant, PSilverman, JLim, A A series of quinoline analogues as potent inhibitors of C. albicans prolyl tRNA synthetase. Bioorg Med Chem Lett 11:541-4 (2001)  
Target
Name:
Bifunctional glutamate/proline--tRNA ligase
Synonyms:
Aminoacyl-tRNA synthetase EPRS GLNS Glutamyl-tRNA synthetase Proliferation-inducing gene 32 protein QARS SYEP_HUMAN
Type:
PROTEIN
Mol. Mass.:
170602.50
Organism:
Homo sapiens (Human)
Description:
ChEMBL_223474
Residue:
1512
  
Inhibitor
Name:
BDBM50097084
Synonyms:
2-(4-Bromo-phenyl)-7-chloro-5-methyl-quinoline-4-carboxylic acid | CHEMBL151769
Type:
Small organic molecule
Emp. Form.:
C17H11BrClNO2
Mol. Mass.:
376.632
SMILES:
Cc1cc(Cl)cc2nc(cc(C(O)=O)c12)-c1ccc(Br)cc1
: