Target
Bifunctional glutamate/proline--tRNA ligase
Ligand
BDBM50097101
Substrate
Meas. Tech.
ChEBML_223472
IC50
>100000±n/a nM
Citation
 Yu, XYHill, JMYu, GYang, YKluge, AFKeith, DFinn, JGallant, PSilverman, JLim, A A series of quinoline analogues as potent inhibitors of C. albicans prolyl tRNA synthetase. Bioorg Med Chem Lett 11:541-4 (2001)  
Target
Name:
Bifunctional glutamate/proline--tRNA ligase
Synonyms:
Aminoacyl-tRNA synthetase EPRS GLNS Glutamyl-tRNA synthetase Proliferation-inducing gene 32 protein QARS SYEP_HUMAN
Type:
PROTEIN
Mol. Mass.:
170602.50
Organism:
Homo sapiens (Human)
Description:
ChEMBL_223474
Residue:
1512
  
Inhibitor
Name:
BDBM50097101
Synonyms:
2-Naphthalen-2-yl-quinoline-4-carboxylic acid | CHEMBL345300
Type:
Small organic molecule
Emp. Form.:
C20H13NO2
Mol. Mass.:
299.3227
SMILES:
OC(=O)c1cc(nc2ccccc12)-c1ccc2ccccc2c1
: