Target
Bifunctional glutamate/proline--tRNA ligase
Ligand
BDBM50097103
Substrate
Meas. Tech.
ChEBML_223472
IC50
35000±n/a nM
Citation
 Yu, XYHill, JMYu, GYang, YKluge, AFKeith, DFinn, JGallant, PSilverman, JLim, A A series of quinoline analogues as potent inhibitors of C. albicans prolyl tRNA synthetase. Bioorg Med Chem Lett 11:541-4 (2001)  
Target
Name:
Bifunctional glutamate/proline--tRNA ligase
Synonyms:
Aminoacyl-tRNA synthetase EPRS GLNS Glutamyl-tRNA synthetase Proliferation-inducing gene 32 protein QARS SYEP_HUMAN
Type:
PROTEIN
Mol. Mass.:
170602.50
Organism:
Homo sapiens (Human)
Description:
ChEMBL_223474
Residue:
1512
  
Inhibitor
Name:
BDBM50097103
Synonyms:
2-(4-Bromo-phenyl)-6-(4-hydroxy-phenyl)-quinoline-4-carboxylic acid | CHEMBL150896
Type:
Small organic molecule
Emp. Form.:
C22H14BrNO3
Mol. Mass.:
420.255
SMILES:
OC(=O)c1cc(nc2ccc(cc12)-c1ccc(O)cc1)-c1ccc(Br)cc1
: