Target
Tyrosine-protein kinase Yes
Ligand
BDBM50354486
Substrate
Meas. Tech.
ChEMBL_1983550 (CHEMBL4616956)
Ki
3467±n/a nM
Citation
 Hu, HBajorath, J Exploring structure-promiscuity relationships using dual-site promiscuity cliffs and corresponding single-site analogs. Bioorg Med Chem 28:0 (2020)  
Target
Name:
Tyrosine-protein kinase Yes
Synonyms:
Proto-oncogene c-Yes YES YES_HUMAN | p61-yes
Type:
Protein
Mol. Mass.:
60801.54
Organism:
Homo sapiens (Human)
Description:
P07947
Residue:
543
  
Inhibitor
Name:
BDBM50354486
Synonyms:
CHEMBL411043
Type:
Small organic molecule
Emp. Form.:
C20H18ClN5
Mol. Mass.:
363.843
SMILES:
ClC(Cn1ncc2c(NCc3ccccc3)ncnc12)c1ccccc1
: