Target
5-hydroxytryptamine receptor 2C
Ligand
BDBM50541199
Substrate
Meas. Tech.
ChEMBL_1983946 (CHEMBL4617352)
Ki
2.8±n/a nM
Citation
 Ren, AZhu, XFeichtinger, KLehman, JKasem, MSchrader, TOWong, ADang, HLe, MFrazer, JUnett, DJGrottick, AJWhelan, KTMorgan, MESage, CRSemple, G Discovery of a lead series of potent benzodiazepine 5-HT Bioorg Med Chem Lett 30:0 (2020)  
Target
Name:
5-hydroxytryptamine receptor 2C
Synonyms:
5-HT-1C 5-HT1C 5-HT2C-INI 5-HTR2C 5-hydroxytryptamine receptor 2C (5-HT-2C) 5HT-1C HTR1C Serotonin (5-HT3) receptor Serotonin Receptor 2C
Type:
G Protein-Coupled Receptor (GPCR)
Mol. Mass.:
51836.79
Organism:
Homo sapiens (Human)
Description:
P28335
Residue:
458
  
Inhibitor
Name:
BDBM50541199
Synonyms:
CHEMBL4632473
Type:
Small organic molecule
Emp. Form.:
C12H14Cl2N2
Mol. Mass.:
257.159
SMILES:
CC1CN2CCNCc3cc(Cl)c(Cl)c1c23
: