Target
Protein kinase C eta type
Ligand
BDBM50097750
Substrate
Meas. Tech.
ChEMBL_161140 (CHEMBL767408)
Ki
0.350000±n/a nM
Citation
 Tanaka, MIrie, KNakagawa, YNakamura, YOhigashi, HWender, PA The C4 hydroxyl group of phorbol esters is not necessary for protein kinase C binding. Bioorg Med Chem Lett 11:719-22 (2001)  
Target
Name:
Protein kinase C eta type
Synonyms:
KPCL_HUMAN PKCL PRKCL Protein kinase C, PKC; classical/novel | nPKC-eta
Type:
Enzyme
Mol. Mass.:
77844.26
Organism:
Homo sapiens (Human)
Description:
The recombinant human PKC enzymes were produced using a baculovirus expression system in SF9 cells
Residue:
683
  
Inhibitor
Name:
BDBM50097750
Synonyms:
Butyric acid (1aR,1bS,4aS,7aR,7bR,8R,9R,9aS)-9-butyryloxy-7b-hydroxy-3-hydroxymethyl-1,1,6,8-tetramethyl-5-oxo-1,1a,1b,4,4a,5,7a,7b,8,9-decahydro-cyclopropa[3,4]benzo[1,2-e]azulen-9a-yl ester | CHEMBL265998
Type:
Small organic molecule
Emp. Form.:
C28H40O7
Mol. Mass.:
488.613
SMILES:
CCCC(=O)O[C@@H]1[C@@H](C)[C@]2(O)[C@@H]3C=C(C)C(=O)[C@H]3CC(CO)=C[C@H]2[C@@H]2C(C)(C)[C@]12OC(=O)CCC
: