Target
Protein kinase C eta type
Ligand
BDBM50057511
Substrate
Meas. Tech.
ChEMBL_161432 (CHEMBL772567)
Ki
5.5±n/a nM
Citation
 Nakagawa, YIrie, KNakamura, YOhigashi, H The amide hydrogen of (-)-indolactam-V and benzolactam-V8's plays a critical role in protein kinase C binding and tumor-promoting activities. Bioorg Med Chem Lett 11:723-8 (2001)  
Target
Name:
Protein kinase C eta type
Synonyms:
KPCL_HUMAN PKCL PRKCL Protein kinase C, PKC; classical/novel | nPKC-eta
Type:
Enzyme
Mol. Mass.:
77844.26
Organism:
Homo sapiens (Human)
Description:
The recombinant human PKC enzymes were produced using a baculovirus expression system in SF9 cells
Residue:
683
  
Inhibitor
Name:
BDBM50057511
Synonyms:
(+/-)-indolactum-V 13-Hydroxymethyl-10-isopropyl-9-methyl-3,9,12-triaza-tricyclo[6.6.1.0*4,15*]pentadeca-1,4,6,8(15)-tetraen-11-one (10S,13S)-13-Hydroxymethyl-10-isopropyl-9-methyl-3,9,12-triaza-tricyclo[6.6.1.0*4,15*]pentadeca-1,4(15),5,7-tetraen-11-one (2S,5S)-5-(hydroxymethyl)-2-isopropyl-1-methyl-1,2,5,6-tetrahydro-4H-[1,4]diazonino[7,6,5-cd]indol-3(8H)-one 13-Hydroxymethyl-10-isopropyl-9-methyl-3,9,12-triaza-tricyclo[6.6.1.0*4,15*]pentadeca-1,4(15),5,7-tetraen-11-one CHEMBL27266 indolactam-V
Type:
Small organic molecule
Emp. Form.:
C17H23N3O2
Mol. Mass.:
301.3834
SMILES:
CC(C)[C@@H]1N(C)c2cccc3[nH]cc(C[C@@H](CO)NC1=O)c23
: