Target
Protein kinase C eta type
Ligand
BDBM50057510
Substrate
Meas. Tech.
ChEMBL_161312 (CHEMBL772754)
Ki
2489±n/a nM
Citation
 Nakagawa, YIrie, KNakamura, YOhigashi, H The amide hydrogen of (-)-indolactam-V and benzolactam-V8's plays a critical role in protein kinase C binding and tumor-promoting activities. Bioorg Med Chem Lett 11:723-8 (2001)  
Target
Name:
Protein kinase C eta type
Synonyms:
KPCL_HUMAN PKCL PRKCL Protein kinase C, PKC; classical/novel | nPKC-eta
Type:
Enzyme
Mol. Mass.:
77844.26
Organism:
Homo sapiens (Human)
Description:
The recombinant human PKC enzymes were produced using a baculovirus expression system in SF9 cells
Residue:
683
  
Inhibitor
Name:
BDBM50057510
Synonyms:
(2S,5S)-8-Decyl-5-hydroxymethyl-2-isopropyl-1-methyl-1,4,5,6-tetrahydro-2H-benzo[e][1,4]diazocin-3-one | CHEMBL28205
Type:
Small organic molecule
Emp. Form.:
C25H42N2O2
Mol. Mass.:
402.6132
SMILES:
CCCCCCCCCCc1ccc2N(C)[C@@H](C(C)C)C(=O)N[C@H](CO)Cc2c1
: