Target
Acidic mammalian chitinase
Ligand
BDBM50541941
Substrate
Meas. Tech.
ChEMBL_1985608 (CHEMBL4619014)
IC50
49±n/a nM
Citation
 Andryianau, GKowalski, MPiotrowicz, MCRajkiewicz, AADymek, BSklepkiewicz, PLPluta, EStefaniak, FCzestkowski, WOlejniczak, SMazur, MNiedziejko, PKoralewski, RMatyszewski, KGruza, MZagozdzon, ASalamon, MRymaszewska, AWelzer, MDzwonek, KGolab, JOlczak, JBartoszewicz, AGolebiowski, A Benzoxazepine-Derived Selective, Orally Bioavailable Inhibitor of Human Acidic Mammalian Chitinase. ACS Med Chem Lett 11:1228-1235 (2020)  
Target
Name:
Acidic mammalian chitinase
Synonyms:
AMCase CHIA Lung-specific protein TSA1902
Type:
Protein
Mol. Mass.:
52266.66
Organism:
Homo sapiens (Human)
Description:
Q9BZP6
Residue:
476
  
Inhibitor
Name:
BDBM50541941
Synonyms:
CHEMBL4647895
Type:
Small organic molecule
Emp. Form.:
C24H26ClN7O
Mol. Mass.:
463.963
SMILES:
Nc1nc(n[nH]1)N1CCC(CC1)N1Cc2cc(ccc2OC[C@@H]1Cc1ccc(Cl)cc1)C#N
: