Target
Nitric oxide synthase, inducible
Ligand
BDBM50098940
Substrate
Meas. Tech.
ChEMBL_51079 (CHEMBL664045)
IC50
350000000±n/a nM
Citation
 Beaton, HHamley, PNicholls, DJTinker, ACWallace, AV 3,4-Dihydro-1-isoquinolinamines: a novel class of nitric oxide synthase inhibitors with a range of isoform selectivity and potency. Bioorg Med Chem Lett 11:1023-6 (2001)  
Target
Name:
Nitric oxide synthase, inducible
Synonyms:
HEP-NOS Inducible NO synthase NOS type II NOS2A Nitric oxide synthase, inducible (iNOS) | iNOS
Type:
Homodimer
Mol. Mass.:
131141.95
Organism:
Homo sapiens (Human)
Description:
P35228
Residue:
1153
  
Inhibitor
Name:
BDBM50098940
Synonyms:
8-Fluoro-3-(4-fluoro-phenyl)-3,4-dihydro-isoquinolin-1-ylamine | CHEMBL7945
Type:
Small organic molecule
Emp. Form.:
C15H12F2N2
Mol. Mass.:
258.266
SMILES:
NC1=NC(Cc2cccc(F)c12)c1ccc(F)cc1
: