Target
Nitric oxide synthase, endothelial
Ligand
BDBM50098961
Substrate
Meas. Tech.
ChEBML_82646
IC50
750±n/a nM
Citation
 Beaton, HBoughton-Smith, NHamley, PGhelani, ANicholls, DJTinker, ACWallace, AV Thienopyridines: nitric oxide synthase inhibitors with potent in vivo activity. Bioorg Med Chem Lett 11:1027-30 (2001)  
Target
Name:
Nitric oxide synthase, endothelial
Synonyms:
Constitutive NOS Endothelial NOS NOS type III NOS3_HUMAN Nitric oxide synthase (inducible and endothelial) Nitric-oxide synthase (endothelial and brain) eNOS
Type:
Enzyme Catalytic Domain
Mol. Mass.:
133297.84
Organism:
Homo sapiens (Human)
Description:
P29474
Residue:
1203
  
Inhibitor
Name:
BDBM50098961
Synonyms:
6-Cyclopropyl-6,7-dihydro-thieno[3,2-c]pyridin-4-ylamine | CHEMBL8105
Type:
Small organic molecule
Emp. Form.:
C10H12N2S
Mol. Mass.:
192.281
SMILES:
NC1=NC(Cc2sccc12)C1CC1
: