Target
Prostaglandin G/H synthase 2
Ligand
BDBM50072064
Substrate
Meas. Tech.
ChEBML_159927
IC50
1100±n/a nM
Citation
 Chauret, NYergey, JABrideau, CFriesen, RWMancini, JRiendeau, DSilva, JStyhler, ATrimble, LANicoll-Griffith, DA In vitro metabolism considerations, including activity testing of metabolites, in the discovery and selection of the COX-2 inhibitor etoricoxib (MK-0663). Bioorg Med Chem Lett 11:1059-62 (2001)  
Target
Name:
Prostaglandin G/H synthase 2
Synonyms:
COX2 Cyclooxygenase 2 (COX-2) Cyclooxygenase-2 (COX-2 AA) Cyclooxygenase-2 (COX-2) PGH2_HUMAN PHS II Prostaglandin E synthase/G/H synthase 2 Prostaglandin-endoperoxide synthase 2
Type:
Enzyme
Mol. Mass.:
69003.89
Organism:
Homo sapiens (Human)
Description:
Recombinant Cox-2 provided by Cayman (Cayman Chemical Co.,Ann Arbor, MI).
Residue:
604
  
Inhibitor
Name:
BDBM50072064
Synonyms:
5-Chloro-3-(4-methanesulfonyl-phenyl)-6''-methyl-[2,3'']bipyridinyl 5-chloro-2-(6-methylpyridin-3-yl)-3-(4-(methylsulfonyl)phenyl)pyridine CHEMBL416146 | ETORICOXIB
Type:
Small organic molecule
Emp. Form.:
C18H15ClN2O2S
Mol. Mass.:
358.842
SMILES:
Cc1ccc(cn1)-c1ncc(Cl)cc1-c1ccc(cc1)S(C)(=O)=O
: