Target
Neuropeptide Y receptor type 4
Ligand
BDBM50409214
Substrate
Meas. Tech.
ChEMBL_140793 (CHEMBL752932)
EC50
2.5±n/a nM
Citation
 Balasubramaniam, ADhawan, VCMullins, DEChance, WTSheriff, SGuzzi, MPrabhakaran, MParker, EM Highly selective and potent neuropeptide Y (NPY) Y1 receptor antagonists based on [Pro(30), Tyr(32), Leu(34)]NPY(28-36)-NH2 (BW1911U90). J Med Chem 44:1479-82 (2001)  
Target
Name:
Neuropeptide Y receptor type 4
Synonyms:
NPY-Y4 NPY4R PP1 Pancreatic polypeptide receptor 1
Type:
Enzyme Catalytic Domain
Mol. Mass.:
42207.58
Organism:
Homo sapiens (Human)
Description:
NPY-Y4 PPYR1 HUMAN::P50391
Residue:
375
  
Inhibitor
Name:
BDBM50409214
Synonyms:
CHEMBL2110365 | GR-231118
Type:
Small organic molecule
Emp. Form.:
C110H170N34O24
Mol. Mass.:
2352.7402
SMILES:
CC[C@H](C)[C@H](N)C(=O)N[C@H]1CCC(=O)NC[C@H](NC(=O)[C@@H]2CCCN2C(=O)[C@H](CCC(=O)NC[C@H](NC(=O)[C@@H]2CCCN2C1=O)C(=O)N[C@@H](Cc1ccc(O)cc1)C(=O)N[C@@H](CCCNC(N)=N)C(=O)N[C@@H](CC(C)C)C(=O)N[C@@H](CCCNC(N)=N)C(=O)N[C@@H](Cc1ccc(O)cc1)C(N)=O)NC(=O)[C@@H](N)[C@@H](C)CC)C(=O)N[C@@H](Cc1ccc(O)cc1)C(=O)N[C@@H](CCCNC(N)=N)C(=O)N[C@@H](CC(C)C)C(=O)N[C@@H](CCCNC(N)=N)C(=O)N[C@@H](Cc1ccc(O)cc1)C(N)=O
: