Target
Receptor-type tyrosine-protein phosphatase C
Ligand
BDBM50099745
Substrate
Meas. Tech.
ChEMBL_39938 (CHEMBL655779)
IC50
900±n/a nM
Citation
 Urbanek, RASuchard, SJSteelman, GBKnappenberger, KSSygowski, LAVeale, CAChapdelaine, MJ Potent reversible inhibitors of the protein tyrosine phosphatase CD45. J Med Chem 44:1777-93 (2001)  
Target
Name:
Receptor-type tyrosine-protein phosphatase C
Synonyms:
CD45 L-CA PTPRC Receptor-type tyrosine-protein phosphatase C (CD45) | T200
Type:
Protein
Mol. Mass.:
147474.19
Organism:
Homo sapiens (Human)
Description:
P08575
Residue:
1306
  
Inhibitor
Name:
BDBM50099745
Synonyms:
4-(Carboxymethyl-carbamoyl)-4-{[1-(2-{2-[(9,10-dioxo-9,10-dihydro-phenanthrene-2-carbonyl)-amino]-5-guanidino-pentanoylamino}-acetyl)-pyrrolidine-2-carbonyl]-amino}-butyric acid | CHEMBL430756
Type:
Small organic molecule
Emp. Form.:
C35H40N8O11
Mol. Mass.:
748.7391
SMILES:
NC(=N)NCCCC(NC(=O)c1ccc2-c3ccccc3C(=O)C(=O)c2c1)C(=O)NCC(=O)N1CCCC1C(=O)NC(CCC(O)=O)C(=O)NCC(O)=O
: