Target
Histamine H2 receptor
Ligand
BDBM50121205
Substrate
Meas. Tech.
ChEMBL_1988825 (CHEMBL4622372)
Ki
295±n/a nM
Citation
 Biselli, SAlencastre, ITropmann, KErdmann, DChen, MLittmann, TMaia, AFGomez-Lazaro, MTanaka, MOzawa, TKeller, MLamghari, MBuschauer, ABernhardt, G Fluorescent H ACS Med Chem Lett 11:1521-1528 (2020)  
Target
Name:
Histamine H2 receptor
Synonyms:
Gastric receptor I HISTAMINE H2 HRH2_HUMAN Histamine H2-Gs alpha S
Type:
G Protein-Coupled Receptor (GPCR)
Mol. Mass.:
40115.31
Organism:
Homo sapiens (Human)
Description:
Residue:
359
  
Inhibitor
Name:
BDBM50121205
Synonyms:
CHEBI:18295 | Histamine
Type:
Small organic molecule
Emp. Form.:
C5H9N3
Mol. Mass.:
111.1451
SMILES:
NCCc1c[nH]cn1
: