Target
Histamine H2 receptor
Ligand
BDBM50543277
Substrate
Meas. Tech.
ChEMBL_1988825 (CHEMBL4622372)
Ki
13±n/a nM
Citation
 Biselli, SAlencastre, ITropmann, KErdmann, DChen, MLittmann, TMaia, AFGomez-Lazaro, MTanaka, MOzawa, TKeller, MLamghari, MBuschauer, ABernhardt, G Fluorescent H ACS Med Chem Lett 11:1521-1528 (2020)  
Target
Name:
Histamine H2 receptor
Synonyms:
Gastric receptor I HISTAMINE H2 HRH2_HUMAN Histamine H2-Gs alpha S
Type:
G Protein-Coupled Receptor (GPCR)
Mol. Mass.:
40115.31
Organism:
Homo sapiens (Human)
Description:
Residue:
359
  
Inhibitor
Name:
BDBM50543277
Synonyms:
CHEMBL4642548
Type:
Small organic molecule
Emp. Form.:
C29H40F6N4O7
Mol. Mass.:
670.6409
SMILES:
OC(=O)C(F)(F)F.OC(=O)C(F)(F)F.NCCCCCCNc1c(NCCCOc2cccc(CN3CCCCC3)c2)c(=O)c1=O
: