Target
Indoleamine 2,3-dioxygenase 1
Ligand
BDBM50543295
Substrate
Meas. Tech.
ChEMBL_1988859 (CHEMBL4622406)
IC50
0.600000±n/a nM
Citation
 Pu, QZhang, HGuo, LCheng, MDoty, ACFerguson, HFradera, XLesburg, CAMcGowan, MAMiller, JRGeda, PSong, XOtte, KSciammetta, NSolban, NYu, WSloman, DLZhou, HLammens, ANeumann, LBennett, DJPasternak, AHan, Y Discovery of Potent and Orally Available Bicyclo[1.1.1]pentane-Derived Indoleamine-2,3-dioxygenase 1 (IDO1) Inhibitors. ACS Med Chem Lett 11:1548-1554 (2020)  
Target
Name:
Indoleamine 2,3-dioxygenase 1
Synonyms:
I23O1_HUMAN IDO-1 INDO Indoleamine 2,3-dioxygenase | Indoleamine-pyrrole 2,3-dioxygenase
Type:
Enzyme
Mol. Mass.:
45330.80
Organism:
Homo sapiens (Human)
Description:
P14902
Residue:
403
  
Inhibitor
Name:
BDBM50543295
Synonyms:
CHEMBL4642946
Type:
Small organic molecule
Emp. Form.:
C21H20Cl2N2O2
Mol. Mass.:
403.302
SMILES:
C[C@H](C(=O)Nc1ccc(Cl)cc1)C12CC(C1)(C2)NC(=O)c1cccc(Cl)c1
: