Target
C-C chemokine receptor type 3
Ligand
BDBM50100046
Substrate
Meas. Tech.
ChEBML_41921
IC50
22500±n/a nM
Citation
 Dhanak, DChristmann, LTDarcy, MGKeenan, RMKnight, SDLee, JRidgers, LHSarau, HMShah, DHWhite, JRZhang, L Discovery of potent and selective phenylalanine derived CCR3 receptor antagonists. Part 2. Bioorg Med Chem Lett 11:1445-50 (2001)  
Target
Name:
C-C chemokine receptor type 3
Synonyms:
C-C CKR-3 CC-CKR-3 CCR3 CD_antigen=CD193 CMKBR3 | Eosinophil eotaxin receptor
Type:
Enzyme
Mol. Mass.:
41053.88
Organism:
Homo sapiens (Human)
Description:
P51677
Residue:
355
  
Inhibitor
Name:
BDBM50100046
Synonyms:
CHEMBL288554 | Naphthalene-1-carboxylic acid [(S)-2-(4-nitro-phenyl)-1-oxazol-5-yl-ethyl]-amide
Type:
Small organic molecule
Emp. Form.:
C22H17N3O4
Mol. Mass.:
387.3881
SMILES:
[O-][N+](=O)c1ccc(C[C@H](NC(=O)c2cccc3ccccc23)c2cnco2)cc1
: