Target
Amyloid-beta precursor protein
Ligand
BDBM50100130
Substrate
Meas. Tech.
ChEMBL_35680 (CHEMBL649529)
Ki
>2000±n/a nM
Citation
 Zhuang, ZPKung, MPHou, CSkovronsky, DMGur, TLPlössl, KTrojanowski, JQLee, VMKung, HF Radioiodinated styrylbenzenes and thioflavins as probes for amyloid aggregates. J Med Chem 44:1905-14 (2001)  
Target
Name:
Amyloid-beta precursor protein
Synonyms:
A4 ABPP AICD-50 AICD-59 AID(57) APP Alzheimer disease amyloid protein Amyloid beta Protein Amyloid beta protein Abeta(1-42) Amyloid intracellular domain 57 Amyloid protein (Abeta42b) Beta amyloid A4 protein Beta-APP42 Beta-amyloid protein 42 C83 CVAP Gamma Secretase Gamma-CTF(57) Gamma-secretase Gamma-secretase C-terminal fragment 57 P3(40) PN-II Protease nexin-II S-APP-beta Soluble APP-beta | beta-Amyloid Precursor Protein (APP)
Type:
Single-pass type I membrane protein
Mol. Mass.:
86890.41
Organism:
Homo sapiens (Human)
Description:
P05067
Residue:
770
  
Inhibitor
Name:
BDBM50100130
Synonyms:
4-(6-Iodobenzo[d]thiazol-2-yl)-N,N-dimethylaniline [4-(6-Iodo-benzothiazol-2-yl)-phenyl]-dimethyl-amine
Type:
Small organic molecule
Emp. Form.:
C15H13IN2S
Mol. Mass.:
380.247
SMILES:
CN(C)c1ccc(cc1)-c1nc2ccc(I)cc2s1
: