Target
Integrin alpha-V/beta-3
Ligand
BDBM50100139
Substrate
Meas. Tech.
ChEMBL_214636 (CHEMBL819716)
IC50
6±n/a nM
Citation
 Sulyok, GAGibson, CGoodman, SLHölzemann, GWiesner, MKessler, H Solid-phase synthesis of a nonpeptide RGD mimetic library: new selective alphavbeta3 integrin antagonists. J Med Chem 44:1938-50 (2001)  
Target
Name:
Integrin alpha-V/beta-3
Synonyms:
ITGAV/ITGB3 | Integrin beta-3/Vitronectin receptor alpha
Type:
Enzyme
Mol. Mass.:
Description:
Components:
This complex has 2 components.
Component 1
Name:
Integrin alpha-V
Synonyms:
ITAV_HUMAN Integrin alpha-V/alpha-5 VNRA Vitronectin receptor | Vitronectin receptor subunit alpha
Type:
PROTEIN
Mol. Mass.:
116024.92
Organism:
Homo sapiens (Human)
Description:
ChEMBL_582336
Residue:
1048
  
Component 2
Name:
Integrin beta-3
Synonyms:
CD_antigen=CD61 GPIIIa ITGB3 Platelet membrane glycoprotein IIIa
Type:
Protein
Mol. Mass.:
87038.91
Organism:
Homo sapiens (Human)
Description:
P05106
Residue:
788
  
Inhibitor
Name:
BDBM50100139
Synonyms:
3-(4-Bromo-phenyl)-5-{N'-[5-(4-methyl-pyridin-2-ylamino)-pentanoyl]-hydrazino}-5-oxo-pentanoic acid | CHEMBL291520
Type:
Small organic molecule
Emp. Form.:
C21H25BrN4O4
Mol. Mass.:
477.352
SMILES:
OC(=O)CC(CC(=O)NNC(=O)CCCCNc1ccccn1)c1ccc(Br)cc1
: