Target
Integrin alpha-V/beta-3
Ligand
BDBM50100142
Substrate
Meas. Tech.
ChEMBL_214636 (CHEMBL819716)
IC50
37±n/a nM
Citation
 Sulyok, GAGibson, CGoodman, SLHölzemann, GWiesner, MKessler, H Solid-phase synthesis of a nonpeptide RGD mimetic library: new selective alphavbeta3 integrin antagonists. J Med Chem 44:1938-50 (2001)  
Target
Name:
Integrin alpha-V/beta-3
Synonyms:
ITGAV/ITGB3 | Integrin beta-3/Vitronectin receptor alpha
Type:
Enzyme
Mol. Mass.:
Description:
Components:
This complex has 2 components.
Component 1
Name:
Integrin alpha-V
Synonyms:
ITAV_HUMAN Integrin alpha-V/alpha-5 VNRA Vitronectin receptor | Vitronectin receptor subunit alpha
Type:
PROTEIN
Mol. Mass.:
116024.92
Organism:
Homo sapiens (Human)
Description:
ChEMBL_582336
Residue:
1048
  
Component 2
Name:
Integrin beta-3
Synonyms:
CD_antigen=CD61 GPIIIa ITGB3 Platelet membrane glycoprotein IIIa
Type:
Protein
Mol. Mass.:
87038.91
Organism:
Homo sapiens (Human)
Description:
P05106
Residue:
788
  
Inhibitor
Name:
BDBM50100142
Synonyms:
5-[N'-(3-Acetimidoylamino-benzoyl)-hydrazino]-3-(4-methoxy-phenyl)-5-oxo-pentanoic acid | CHEMBL59555
Type:
Small organic molecule
Emp. Form.:
C21H24N4O5
Mol. Mass.:
412.4391
SMILES:
COc1ccc(cc1)C(CC(O)=O)CC(=O)NNC(=O)c1cccc(c1)N=C(C)N
: