Target
Integrin alpha-V/beta-3
Ligand
BDBM50100143
Substrate
Meas. Tech.
ChEMBL_214636 (CHEMBL819716)
IC50
6±n/a nM
Citation
 Sulyok, GAGibson, CGoodman, SLHölzemann, GWiesner, MKessler, H Solid-phase synthesis of a nonpeptide RGD mimetic library: new selective alphavbeta3 integrin antagonists. J Med Chem 44:1938-50 (2001)  
Target
Name:
Integrin alpha-V/beta-3
Synonyms:
ITGAV/ITGB3 | Integrin beta-3/Vitronectin receptor alpha
Type:
Enzyme
Mol. Mass.:
Description:
Components:
This complex has 2 components.
Component 1
Name:
Integrin alpha-V
Synonyms:
ITAV_HUMAN Integrin alpha-V/alpha-5 VNRA Vitronectin receptor | Vitronectin receptor subunit alpha
Type:
PROTEIN
Mol. Mass.:
116024.92
Organism:
Homo sapiens (Human)
Description:
ChEMBL_582336
Residue:
1048
  
Component 2
Name:
Integrin beta-3
Synonyms:
CD_antigen=CD61 GPIIIa ITGB3 Platelet membrane glycoprotein IIIa
Type:
Protein
Mol. Mass.:
87038.91
Organism:
Homo sapiens (Human)
Description:
P05106
Residue:
788
  
Inhibitor
Name:
BDBM50100143
Synonyms:
CHEMBL294603 | [11-Benzyl-5-(3-guanidino-propyl)-8-isopropyl-10-methyl-3,6,9,12,15-pentaoxo-1,2,4,7,10,13hexaaza-cyclopentadec-14-yl]-acetic acid
Type:
Small organic molecule
Emp. Form.:
C26H39N9O7
Mol. Mass.:
589.644
SMILES:
CC(C)C1NC(=O)C(CCCNC(N)=N)NC(=O)NNC(=O)C(CC(O)=O)NC(=O)C(Cc2ccccc2)N(C)C1=O
: