Target
Integrin alpha-IIb/beta-3
Ligand
BDBM50100158
Substrate
Meas. Tech.
ChEMBL_30109 (CHEMBL642036)
IC50
>1000±n/a nM
Citation
 Sulyok, GAGibson, CGoodman, SLHölzemann, GWiesner, MKessler, H Solid-phase synthesis of a nonpeptide RGD mimetic library: new selective alphavbeta3 integrin antagonists. J Med Chem 44:1938-50 (2001)  
Target
Name:
Integrin alpha-IIb/beta-3
Synonyms:
Glycoprotein IIb/IIIa
Type:
Mol. Mass.:
Description:
ASSAY_ID of EBI is 30109
Components:
This complex has 2 components.
Component 1
Name:
Integrin beta-3
Synonyms:
CD_antigen=CD61 GPIIIa ITGB3 Platelet membrane glycoprotein IIIa
Type:
Protein
Mol. Mass.:
87038.91
Organism:
Homo sapiens (Human)
Description:
P05106
Residue:
788
  
Component 2
Name:
Integrin alpha-IIb
Synonyms:
CD_antigen=CD41 GPIIb Glycoprotein IIb ITGA2B Integrin alpha-IIb heavy chain Integrin alpha-IIb light chain, form 2 Integrin alpha-V/beta-3 and alpha-IIb/beta 3 | Platelet membrane glycoprotein IIb
Type:
Protein
Mol. Mass.:
113354.85
Organism:
Homo sapiens (Human)
Description:
P08514
Residue:
1039
  
Inhibitor
Name:
BDBM50100158
Synonyms:
3-{N-[N'-(5-guanidinobenzoyl)hydrazino]carbonyl}-amino-3-(4-triflouromethoxyphenyl)propionic acid | CHEMBL292199
Type:
Small organic molecule
Emp. Form.:
C19H19F3N6O5
Mol. Mass.:
468.3866
SMILES:
[#7]\[#6](-[#7])=[#7]\c1cccc(c1)-[#6](=O)-[#7]-[#7]-[#6](=O)-[#7]-[#6](-[#6]-[#6](-[#8])=O)-c1ccc(-[#8]C(F)(F)F)cc1
: