Target
Integrin alpha-V/beta-3
Ligand
BDBM50100174
Substrate
Meas. Tech.
ChEMBL_214636 (CHEMBL819716)
IC50
3±n/a nM
Citation
 Sulyok, GAGibson, CGoodman, SLHölzemann, GWiesner, MKessler, H Solid-phase synthesis of a nonpeptide RGD mimetic library: new selective alphavbeta3 integrin antagonists. J Med Chem 44:1938-50 (2001)  
Target
Name:
Integrin alpha-V/beta-3
Synonyms:
ITGAV/ITGB3 | Integrin beta-3/Vitronectin receptor alpha
Type:
Enzyme
Mol. Mass.:
Description:
Components:
This complex has 2 components.
Component 1
Name:
Integrin alpha-V
Synonyms:
ITAV_HUMAN Integrin alpha-V/alpha-5 VNRA Vitronectin receptor | Vitronectin receptor subunit alpha
Type:
PROTEIN
Mol. Mass.:
116024.92
Organism:
Homo sapiens (Human)
Description:
ChEMBL_582336
Residue:
1048
  
Component 2
Name:
Integrin beta-3
Synonyms:
CD_antigen=CD61 GPIIIa ITGB3 Platelet membrane glycoprotein IIIa
Type:
Protein
Mol. Mass.:
87038.91
Organism:
Homo sapiens (Human)
Description:
P05106
Residue:
788
  
Inhibitor
Name:
BDBM50100174
Synonyms:
3-Biphenyl-4-yl-4-{N'-[5-(4-methyl-pyridin-2-ylamino)-pentanoyl]-hydrazinocarbonyl}-butyric acid CHEMBL417066
Type:
Small organic molecule
Emp. Form.:
C28H32N4O4
Mol. Mass.:
488.5781
SMILES:
Cc1ccnc(NCCCCC(=O)NNC(=O)CC(CC(O)=O)c2ccc(cc2)-c2ccccc2)c1
: