Target
Alpha-1D adrenergic receptor
Ligand
BDBM50100229
Substrate
Meas. Tech.
ChEMBL_32722 (CHEMBL645994)
Ki
0.77±n/a nM
Citation
 Meyer, MDAltenbach, RJBai, HBasha, FZCarroll, WAKerwin, JFLebold, SALee, EPratt, JKSippy, KBTietje, KWendt, MDBrune, MEBuckner, SAHancock, AADrizin, I Structure-activity studies for a novel series of bicyclic substituted hexahydrobenz[e]isoindole alpha1A adrenoceptor antagonists as potential agents for the symptomatic treatment of benign prostatic hyperplasia. J Med Chem 44:1971-85 (2001)  
Target
Name:
Alpha-1D adrenergic receptor
Synonyms:
ADA1D_RAT Adra1d Alpha-1D adrenergic receptor | Serotonin 1a (5-HT1a) receptor/Adrenergic receptor alpha-1
Type:
Protein
Mol. Mass.:
59375.97
Organism:
Rattus norvegicus (Rat)
Description:
P23944
Residue:
561
  
Inhibitor
Name:
BDBM50100229
Synonyms:
3-[2-(6-Methoxy-1,3,3a,4,5,9b-hexahydro-benzo[e]isoindol-2-yl)-ethyl]-2,4-dioxo-1,2,3,4-tetrahydro-quinazoline-7-carbonitrile | CHEMBL62033
Type:
Small organic molecule
Emp. Form.:
C24H24N4O3
Mol. Mass.:
416.4724
SMILES:
COc1cccc2[C@@H]3CN(CCn4c(=O)[nH]c5cc(ccc5c4=O)C#N)C[C@@H]3CCc12
: