Target
Alpha-1D adrenergic receptor
Ligand
BDBM50100219
Substrate
Meas. Tech.
ChEMBL_32722 (CHEMBL645994)
Ki
0.69±n/a nM
Citation
 Meyer, MDAltenbach, RJBai, HBasha, FZCarroll, WAKerwin, JFLebold, SALee, EPratt, JKSippy, KBTietje, KWendt, MDBrune, MEBuckner, SAHancock, AADrizin, I Structure-activity studies for a novel series of bicyclic substituted hexahydrobenz[e]isoindole alpha1A adrenoceptor antagonists as potential agents for the symptomatic treatment of benign prostatic hyperplasia. J Med Chem 44:1971-85 (2001)  
Target
Name:
Alpha-1D adrenergic receptor
Synonyms:
ADA1D_RAT Adra1d Alpha-1D adrenergic receptor | Serotonin 1a (5-HT1a) receptor/Adrenergic receptor alpha-1
Type:
Protein
Mol. Mass.:
59375.97
Organism:
Rattus norvegicus (Rat)
Description:
P23944
Residue:
561
  
Inhibitor
Name:
BDBM50100219
Synonyms:
5-Chloro-3-[2-(6-methoxy-1,3,3a,4,5,9b-hexahydro-benzo[e]isoindol-2-yl)-ethyl]-1H-quinazoline-2,4-dione | CHEMBL440865
Type:
Small organic molecule
Emp. Form.:
C23H24ClN3O3
Mol. Mass.:
425.908
SMILES:
COc1cccc2[C@@H]3CN(CCn4c(=O)[nH]c5cccc(Cl)c5c4=O)C[C@@H]3CCc12
: