Target
Alpha-1B adrenergic receptor
Ligand
BDBM50100238
Substrate
Meas. Tech.
ChEMBL_34198 (CHEMBL649215)
Ki
0.66±n/a nM
Citation
 Meyer, MDAltenbach, RJBai, HBasha, FZCarroll, WAKerwin, JFLebold, SALee, EPratt, JKSippy, KBTietje, KWendt, MDBrune, MEBuckner, SAHancock, AADrizin, I Structure-activity studies for a novel series of bicyclic substituted hexahydrobenz[e]isoindole alpha1A adrenoceptor antagonists as potential agents for the symptomatic treatment of benign prostatic hyperplasia. J Med Chem 44:1971-85 (2001)  
Target
Name:
Alpha-1B adrenergic receptor
Synonyms:
ADA1B_HUMAN Adrenergic alpha1B Adrenergic receptor alpha Alpha 1B-adrenoreceptor | Alpha-1B adrenergic receptor
Type:
Enzyme
Mol. Mass.:
56862.13
Organism:
Homo sapiens (Human)
Description:
P35368
Residue:
520
  
Inhibitor
Name:
BDBM50100238
Synonyms:
7-Methoxy-3-[2-(6-methoxy-1,3,3a,4,5,9b-hexahydro-benzo[e]isoindol-2-yl)-ethyl]-1H-quinazoline-2,4-dione | CHEMBL58956
Type:
Small organic molecule
Emp. Form.:
C24H27N3O4
Mol. Mass.:
421.4889
SMILES:
COc1ccc2c(c1)[nH]c(=O)n(CCN1C[C@@H]3CCc4c(OC)cccc4[C@@H]3C1)c2=O
: