Target
Adenosine kinase
Ligand
BDBM50100585
Substrate
Meas. Tech.
ChEMBL_31125 (CHEMBL643553)
IC50
4750±n/a nM
Citation
 Lee, CHJiang, MCowart, MGfesser, GPerner, RKim, KHGu, YGWilliams, MJarvis, MFKowaluk, EAStewart, AOBhagwat, SS Discovery of 4-amino-5-(3-bromophenyl)-7-(6-morpholino-pyridin-3-yl)pyrido[2,3-d]pyrimidine, an orally active, non-nucleoside adenosine kinase inhibitor.. J Med Chem 44:2133-8 (2001)  
Target
Name:
Adenosine kinase
Synonyms:
ADENOSINE Adenosine 5-phosphotransferase Adenosine kinase | Adk
Type:
Enzyme
Mol. Mass.:
40130.14
Organism:
Rattus norvegicus (rat)
Description:
Rat brain cytosol as enzyme source.
Residue:
361
  
Inhibitor
Name:
BDBM50100585
Synonyms:
7-(4-Nitro-phenyl)-pteridin-4-ylamine | CHEMBL308008
Type:
Small organic molecule
Emp. Form.:
C12H8N6O2
Mol. Mass.:
268.2309
SMILES:
Nc1ncnc2nc(cnc12)-c1ccc(cc1)[N+]([O-])=O
: