Target
Collagenase ColA
Ligand
BDBM50100825
Substrate
Meas. Tech.
ChEMBL_49485 (CHEMBL659907)
Ki
5200±n/a nM
Citation
 Clare, BWScozzafava, ASupuran, CT Protease inhibitors: synthesis of a series of bacterial collagenase inhibitors of the sulfonyl amino acyl hydroxamate type. J Med Chem 44:2253-8 (2001)  
Target
Name:
Collagenase ColA
Synonyms:
120 kDa collagenase Microbial collagenase | colA
Type:
PROTEIN
Mol. Mass.:
125901.02
Organism:
Clostridium perfringens
Description:
ChEMBL_49485
Residue:
1104
  
Inhibitor
Name:
BDBM50100825
Synonyms:
2-[(3-Nitro-benzenesulfonyl)-(2-nitro-benzyl)-amino]-propionic acid | CHEMBL73357
Type:
Small organic molecule
Emp. Form.:
C16H15N3O8S
Mol. Mass.:
409.371
SMILES:
CC(N(Cc1ccccc1[N+]([O-])=O)S(=O)(=O)c1cccc(c1)[N+]([O-])=O)C(O)=O
: