Target
Tryptase beta-2/delta/gamma
Ligand
BDBM50101011
Substrate
Meas. Tech.
ChEMBL_210696 (CHEMBL817294)
Ki
0.850000±n/a nM
Citation
 Dener, JMRice, KDNewcomb, WSWang, VRYoung, WBGangloff, ARKuo, EYCregar, LPutnam, DWong, M Dibasic inhibitors of human mast cell tryptase. Part 3: identification of a series of potent and selective inhibitors containing the benzamidine functionality. Bioorg Med Chem Lett 11:1629-33 (2001)  
Target
Name:
Tryptase beta-2/delta/gamma
Synonyms:
Tryptase
Type:
Mol. Mass.:
Description:
ASSAY_ID of ChEMBL is 1510505
Components:
This complex has 3 components.
Component 1
Name:
Tryptase gamma
Synonyms:
PRSS31 TMT TRYG1_HUMAN Tryptase Tryptase gamma heavy chain | Tryptase gamma light chain
Type:
PROTEIN
Mol. Mass.:
33817.52
Organism:
Homo sapiens (Human)
Description:
ChEMBL_210833
Residue:
321
  
Component 2
Name:
Tryptase beta-2
Synonyms:
TPS2 TRYB2_HUMAN Tryptase II Tryptase-2
Type:
PROTEIN
Mol. Mass.:
30518.79
Organism:
Homo sapiens (Human)
Description:
ChEMBL_210702
Residue:
275
  
Component 3
Name:
Tryptase delta
Synonyms:
Delta-tryptase Mast cell mMCP-7-like TRYD_HUMAN Tryptase-3
Type:
PROTEIN
Mol. Mass.:
26578.73
Organism:
Homo sapiens (Human)
Description:
ChEMBL_104777
Residue:
242
  
Inhibitor
Name:
BDBM50101011
Synonyms:
1,5-di{4-[4-amino(imino)methylphenylcarboxamidomethyl]hexahydro-1-pyridinylcarbonyloxy}cyclooctane | CHEMBL43938
Type:
Small organic molecule
Emp. Form.:
C38H52N8O6
Mol. Mass.:
716.8695
SMILES:
NC(=N)c1ccc(cc1)C(=O)NCC1CCN(CC1)C(=O)O[C@H]1CCC[C@H](CCC1)OC(=O)N1CCC(CNC(=O)c2ccc(cc2)C(N)=N)CC1
: