Target
Thymidine kinase
Ligand
BDBM50101053
Substrate
Meas. Tech.
ChEBML_210611
IC50
2.9±n/a nM
Citation
 Martin, JALambert, RWMerrett, JHParkes, KEThomas, GJBaker, SJBushnell, DJCansfield, JEDunsdon, SJFreeman, ACHopkins, RAJohns, IRKeech, ESimmonite, HWalmsley, AWong Kai-In, PHolland, M Nucleoside analogues as highly potent and selective inhibitors of herpes simplex virus thymidine kinase. Bioorg Med Chem Lett 11:1655-8 (2001)  
Target
Name:
Thymidine kinase
Synonyms:
KITH_HHV1S Thymidine kinase | UL23
Type:
PROTEIN
Mol. Mass.:
40883.42
Organism:
Human herpesvirus 1 (strain SC16) (HHV-1) (Human herpes simplex virus1)
Description:
ChEMBL_213
Residue:
376
  
Inhibitor
Name:
BDBM50101053
Synonyms:
9H-Xanthene-9-carboxylic acid [(2R,3S,5R)-5-(5-ethyl-2,4-dioxo-3,4-dihydro-2H-pyrimidin-1-yl)-3-hydroxy-tetrahydro-furan-2-ylmethyl]-amide | CHEMBL47089
Type:
Small organic molecule
Emp. Form.:
C25H25N3O6
Mol. Mass.:
463.4825
SMILES:
CCc1cn([C@H]2C[C@H](O)[C@@H](CNC(=O)C3c4ccccc4Oc4ccccc34)O2)c(=O)[nH]c1=O
: