Target
Proto-oncogene tyrosine-protein kinase Src
Ligand
BDBM50101077
Substrate
Meas. Tech.
ChEMBL_216577 (CHEMBL818888)
IC50
1200±n/a nM
Citation
 Sundaramoorthi, RSiedem, CVu, CBDalgarno, DCLaird, ECBotfield, MCCombs, ABAdams, SEYuan, RWWeigele, MNarula, SS Selective inhibition of Src SH2 by a novel thiol-targeting tricarbonyl-modified inhibitor and mechanistic analysis by (1)H/(13)C NMR spectroscopy. Bioorg Med Chem Lett 11:1665-9 (2001)  
Target
Name:
Proto-oncogene tyrosine-protein kinase Src
Synonyms:
Calmodulin/Proto-oncogene tyrosine-protein kinase Src Proto-oncogene c-Src SRC SRC_HUMAN V-src sarcoma (Schmidt-Ruppin A-2) viral oncogene homolog (avian) p60-Src | pp60c-src
Type:
Protein
Mol. Mass.:
59838.60
Organism:
Homo sapiens (Human)
Description:
P12931
Residue:
536
  
Inhibitor
Name:
BDBM50101077
Synonyms:
(1S,4S)-2-((S)-2-{(S)-2-[2-Amino-3-(4-phosphonooxy-phenyl)-propionylamino]-4-carboxy-butyrylamino}-4-carboxy-butyrylamino)-3-methyl-pentanoic acid (S)-2-((S)-2-{(S)-2-[(S)-2-Amino-3-(4-phosphonooxy-phenyl)-propionylamino]-4-carboxy-1-oxo-butylamino}-4-carboxy-butyrylamino)-3-methyl-pentanoic acid | CHEMBL46851
Type:
Small organic molecule
Emp. Form.:
C25H37N4O13P
Mol. Mass.:
632.554
SMILES:
CC[C@H](C)[C@H](NC(=O)[C@H](CCC(O)=O)NC(=O)[C@H](CCC(O)=O)NC(=O)[C@@H](N)Cc1ccc(OP(O)(O)=O)cc1)C(O)=O
: