Target
Chymotrypsin-C
Ligand
BDBM50101131
Substrate
Meas. Tech.
ChEBML_216444
IC50
2.4±n/a nM
Citation
 Aoyama, YUenaka, MKonoike, THayasaki-Kajiwara, YNaya, NNakajima, M Inhibition of serine proteases: activity of 1,3-diazetidine-2,4-diones. Bioorg Med Chem Lett 11:1691-4 (2001)  
Target
Name:
Chymotrypsin-C
Synonyms:
CLCR CTRC_HUMAN Chymotrypsin Chymotrypsin-C
Type:
Enzyme
Mol. Mass.:
29487.98
Organism:
Homo sapiens (Human)
Description:
Q99895
Residue:
268
  
Inhibitor
Name:
BDBM50101131
Synonyms:
1,3-Di-p-tolyl-[1,3]diazetidine-2,4-dione | CHEMBL296771
Type:
Small organic molecule
Emp. Form.:
C16H14N2O2
Mol. Mass.:
266.2946
SMILES:
Cc1ccc(cc1)N1C(=O)N(C1=O)c1ccc(C)cc1
: