Target
Stromelysin-1
Ligand
BDBM50101499
Substrate
Meas. Tech.
ChEMBL_104874 (CHEMBL708551)
Ki
2.98±n/a nM
Citation
 Terp, GEJohansen, BNChristensen, ITJørgensen, FS A new concept for multidimensional selection of ligand conformations (MultiSelect) and multidimensional scoring (MultiScore) of protein-ligand binding affinities. J Med Chem 44:2333-43 (2001)  
Target
Name:
Stromelysin-1
Synonyms:
MMP-3 MMP3_HUMAN Matrix metalloproteinase 3 Matrix metalloproteinase-3 (MMP-3) SL-1 Stromelysin 1 | Transin-1
Type:
Enzyme
Mol. Mass.:
53973.13
Organism:
Homo sapiens (Human)
Description:
P08254
Residue:
477
  
Inhibitor
Name:
BDBM50101499
Synonyms:
CHEMBL74040 | N*1*-(2-Cyclohexyl-1-{2-[2-(4-sulfamoyl-phenyl)-ethylcarbamoyl]-ethylcarbamoyl}-ethyl)-N*4*-hydroxy-2-(3-p-tolyl-propyl)-succinamide
Type:
Small organic molecule
Emp. Form.:
C34H49N5O7S
Mol. Mass.:
671.847
SMILES:
Cc1ccc(CCC[C@H](CC(=O)NO)C(=O)N[C@@H](CC2CCCCC2)C(=O)NCCC(=O)NCCc2ccc(cc2)S(N)(=O)=O)cc1
: