Target
72 kDa type IV collagenase
Ligand
BDBM50101511
Substrate
Meas. Tech.
ChEMBL_104539 (CHEMBL718926)
Ki
0.03±n/a nM
Citation
 Terp, GEJohansen, BNChristensen, ITJørgensen, FS A new concept for multidimensional selection of ligand conformations (MultiSelect) and multidimensional scoring (MultiScore) of protein-ligand binding affinities. J Med Chem 44:2333-43 (2001)  
Target
Name:
72 kDa type IV collagenase
Synonyms:
72 kDa gelatinase CLG4A Gelatinase A (MMP-2) MMP2_HUMAN Matrix metalloproteinase-2 (MMP 2) Matrix metalloproteinases 2 (MMP-2) | TBE-1
Type:
Enzyme
Mol. Mass.:
73870.36
Organism:
Homo sapiens (Human)
Description:
P08253
Residue:
660
  
Inhibitor
Name:
BDBM50101511
Synonyms:
2-[3-(4-Chloro-phenyl)-propyl]-N*1*-(2-cyclohexyl-1-{2-[2-(4-sulfamoyl-phenyl)-ethylcarbamoyl]-ethylcarbamoyl}-ethyl)-N*4*-hydroxy-succinamide | CHEMBL422058
Type:
Small organic molecule
Emp. Form.:
C33H46ClN5O7S
Mol. Mass.:
692.266
SMILES:
NS(=O)(=O)c1ccc(CCNC(=O)CCNC(=O)[C@H](CC2CCCCC2)NC(=O)[C@H](CCCc2ccc(Cl)cc2)CC(=O)NO)cc1
: