Target
72 kDa type IV collagenase
Ligand
BDBM50101505
Substrate
Meas. Tech.
ChEMBL_104539 (CHEMBL718926)
Ki
0.01±n/a nM
Citation
 Terp, GEJohansen, BNChristensen, ITJørgensen, FS A new concept for multidimensional selection of ligand conformations (MultiSelect) and multidimensional scoring (MultiScore) of protein-ligand binding affinities. J Med Chem 44:2333-43 (2001)  
Target
Name:
72 kDa type IV collagenase
Synonyms:
72 kDa gelatinase CLG4A Gelatinase A (MMP-2) MMP2_HUMAN Matrix metalloproteinase-2 (MMP 2) Matrix metalloproteinases 2 (MMP-2) | TBE-1
Type:
Enzyme
Mol. Mass.:
73870.36
Organism:
Homo sapiens (Human)
Description:
P08253
Residue:
660
  
Inhibitor
Name:
BDBM50101505
Synonyms:
3-(3-{2-[5-(4-Chloro-phenyl)-2-hydroxycarbamoylmethyl-pentanoylamino]-3-cyclohexyl-propionylamino}-propionylamino)-propionic acid methyl ester | CHEMBL308533
Type:
Small organic molecule
Emp. Form.:
C29H43ClN4O7
Mol. Mass.:
595.127
SMILES:
COC(=O)CCNC(=O)CCNC(=O)[C@H](CC1CCCCC1)NC(=O)[C@H](CCCc1ccc(Cl)cc1)CC(=O)NO
: